{"text_format":"2","workbook":"xlsx","n_sheets":3,"sheets":["입력및결과","계산","적용값"],"not_rendered":{"charts":0,"images":0,"macros":0,"external_links":0,"defined_names":5,"comments":0,"pivot_tables":0},"unopened":[],"bounds":{"document_bytes":16777216,"sheet_cells":100000,"run_cost":"one","rows_first":2000,"rows_last":500,"rows_between":2000,"halvings":0,"cell_chars":16384,"cell_head_chars":4096},"cells_cut":0,"cells_raw":0,"read":"whole","date_system":"1900"}

{"sheet":"입력및결과","index":0,"n_rows":59,"n_cols":6,"rows_kept":59,"cut":false,"hidden":false,"merged":[[1,0,1,5],[8,0,8,1],[23,2,23,4],[23,1,24,1],[23,0,24,0],[23,5,24,5],[9,0,10,0],[8,3,8,5],[9,3,9,5],[10,3,10,5],[13,0,13,1],[13,3,13,5],[14,3,14,5],[14,0,14,1],[49,3,49,5],[50,3,50,5],[35,0,39,0],[25,0,29,0],[30,0,34,0],[54,0,54,1],[30,5,34,5],[35,5,39,5],[43,0,43,1],[44,0,48,0],[51,0,51,1],[49,0,49,1],[50,0,50,1],[47,3,47,5],[54,3,54,5],[43,3,43,5],[44,3,44,5],[45,3,45,5],[46,3,46,5],[48,3,48,5],[51,3,51,5],[57,0,57,1],[56,0,56,1],[55,0,55,1],[58,0,58,1],[56,3,56,5],[57,3,57,5],[58,3,58,5],[55,3,55,5]]}
[]
["입력 및 결과표"]
[]
["※ 입력 및 결과 시트의 초록색(입력) 칸을 채우면 결과가 자동 계산됩니다."]
[]
["1. 가구 구성원"]
["  ※ 지원자 본인이 미혼인 경우 '가. 미혼'의 항목별 값 기입, 기혼인 경우 '나. 기혼' 기입"]
["  가. 미혼"]
["구분",null,"입력","비고"]
["미혼","부모 수",0,"기혼자는 미기입, 한부모는 1명 기입"]
[null,"형제,자매 수(본인 포함)",0,"기혼자는 미기입, 3명 이상 공제"]
[]
["  나. 기혼"]
["구분",null,"입력","비고"]
["기혼",null,0,"결혼유지 중인 경우 2 기입, 이혼(사별)인 경우 1 기입"]
["주1) 자녀는 포함하지 않음"]
[]
[]
[]
[]
[]
[]
["2. 소득",{"$nulls":4},"단위 : 원"]
["대상자","구분","금액",null,null,"비고"]
[null,null,"연간 금액","개월 수","월 금액"]
["지원자\n본인","근로소득",0,12,{"$f":"ROUNDDOWN(C26/D26,)","v":0},"상시근로소득, 자활근로소득, 공공일자리소득 연간금액"]
[null,"일용소득",0,3,{"$f":"ROUNDDOWN(C27/D27,)","v":0},"일용근로소득(전전분기) 3개월치 금액"]
[null,"사업소득",0,12,{"$f":"ROUNDDOWN(C28/D28,)","v":0},"농업소득, 임업소득, 어업소득, 기타사업소득"]
[null,"재산소득",0,12,{"$f":"ROUNDDOWN(C29/D29,)","v":0},"임대소득, 이자소득, 연금소득"]
[null,"기타소득",0,12,0,"공적이전소득(각종 수당, 연금급여 금품 등)"]
["가구원1","근로소득",0,12,0,"지원자와 동일"]
[null,"일용소득",0,3,{"$f":"ROUNDDOWN(C32/D32,)","v":0}]
[null,"사업소득",0,12,0]
[null,"재산소득",0,12,0]
[null,"기타소득",0,12,0]
["가구원2","근로소득",0,12,{"$f":"ROUNDDOWN(C36/D36,)","v":0},"지원자와 동일"]
[null,"일용소득",0,3,{"$f":"ROUNDDOWN(C37/D37,)","v":0}]
[null,"사업소득",0,12,{"$f":"ROUNDDOWN(C38/D38,)","v":0}]
[null,"재산소득",0,12,0]
[null,"기타소득",0,12,0]
[]
["3. 재산"]
["  ※ 본인 및 부모 재산만 합산하고 형제,자매 재산은 제외",{"$nulls":4},"단위 : 원"]
["구분",null,"금액","비고"]
["일반재산","주택, 건축물",0,"주택, 건물, 시설물 등의 시가표준액 합계액"]
[null,"토지",0,"토지의 시가표준액 합계액"]
[null,"임차보증금(주거 목적)",0,"주거목적 임차보증금"]
[null,"임차보증금(주거 목적 이외)",0,"주택, 상가 등의 보증금 및 전세금의 합계액"]
[null,"기타 일반재산",0,"선박, 항공기, 동산, 입목재산, 회원권, 조합원입주권, 분양권, 어업군 등의 합계액"]
["금융재산",null,0,"현금, 수표, 어음, 주식, 국공채 등 유가증권, 예적금, 부금, 보험, 수익증권 등"]
["부채",null,0,"금융기관 대출금, 임대보증금, 한국장학재단 학자금대출잔액 등"]
["차량가격",null,0,"보험개발원에서 제공하는 차량 기준가액\n※ 단, 장애인 소유 자동차는 최대 1대에 한하여 제외 가능"]
[]
["4. 결과(자동 계산)",{"$nulls":4},"단위 : 원"]
["구분",null,"결과 값","비고"]
["가구 수",null,{"$f":"계산!D10","v":0},"가족 구성원 수"]
["기준 중위소득액",null,{"$f":"HLOOKUP(C56,적용값!$B$18:$H$19,2,FALSE)","v":{"$error":"#N/A"}},"가구 수에 해당하는 기준 중위소득"]
["지원자의 소득인정액(월)",null,{"$f":"계산!D75","v":0},"소득평가액(월) + 재산의 소득환산액(월) - 형재,자매 수 공제액"]
["대상자 적격 여부",null,{"$f":"IF(C58<=C57,\"적격\",\"부적격\")","v":{"$error":"#N/A"}},"기준 중위소득과 같거나 낮은 금액일 경우 적격"]

{"sheet":"계산","index":1,"n_rows":75,"n_cols":5,"rows_kept":75,"cut":false,"hidden":false,"merged":[[1,0,1,4],[12,1,12,2],[21,1,21,2],[17,2,19,2],[13,1,20,1],[22,1,22,2],[23,1,23,2],[13,0,23,0],[24,0,31,0],[24,1,28,1],[29,1,29,2],[30,1,30,2],[31,1,31,2],[66,0,66,2],[38,1,38,2],[40,0,40,2],[44,1,49,1],[32,0,39,0],[32,1,36,1],[37,1,37,2],[39,1,39,2],[57,0,62,0],[54,1,56,1],[44,0,56,0],[53,1,53,2],[59,1,59,2],[74,0,74,2],[4,0,4,2],[70,0,70,2],[71,0,71,2],[72,1,72,2],[73,1,73,2],[5,0,7,1],[9,0,9,2],[8,0,8,2],[69,0,69,2],[72,0,73,0],[63,0,65,0],[63,1,65,1],[60,1,62,1],[50,1,52,1],[43,0,43,2]]}
[]
["소득인정액(월) 계산표"]
[]
["1. 가구 수",null,null,null,"단위 : 명"]
["구분",null,null,"인원","비고"]
["미혼자 가구 수",null,"부모 수",{"$f":"입력및결과!C10","v":0}]
[null,null,"형제,자매 수",{"$f":"입력및결과!C11","v":0}]
[null,null,"가구 수",{"$f":"SUM(D6:D7)","v":0}]
["기혼자 가구 수",null,null,{"$f":"입력및결과!C15","v":0}]
["가구 수",null,null,{"$f":"D8+D9","v":0}]
[]
["2. 소득평가액(월)",null,null,null,"단위 : 원"]
["대상자","구분",null,"금액","비고"]
["지원자\n본인","근로/사업소득","근로소득액",{"$f":"입력및결과!E26","v":0}]
[null,null,"일용소득액",{"$f":"입력및결과!E27","v":0}]
[null,null,"사업소득액",{"$f":"입력및결과!E28","v":0}]
[null,null,"소계",{"$f":"SUM(D14:D16)","v":0}]
[null,null,"공제",{"$f":"적용값!F7","v":1300000},"A : 근로/사업소득 공제액"]
[null,null,null,{"$f":"ROUNDDOWN(D15*적용값!$F$8,)","v":0},"B : 일용소득 공제액(50%)"]
[null,null,null,{"$f":"MAX(D18,D19)","v":1300000},"A,B 중 큰 금액 적용"]
[null,null,"적용 금액",{"$f":"IF(D17-D20>0,D17-D20,0)","v":0}]
[null,"재산소득액",null,{"$f":"입력및결과!E29","v":0}]
[null,"기타소득액",null,{"$f":"입력및결과!E30","v":0}]
[null,"소계",null,{"$f":"D21+D22+D23","v":0}]
["가구원1","근로/사업소득","근로소득액",{"$f":"입력및결과!E31","v":0}]
[null,null,"일용소득액",{"$f":"입력및결과!E32","v":0}]
[null,null,"일용소득 공제액",{"$f":"ROUNDDOWN(D26*적용값!$F$8,)","v":0},"일용소득액의 50%"]
[null,null,"사업소득액",{"$f":"입력및결과!E33","v":0}]
[null,null,"적용 금액",{"$f":"D25+D26-D27+D28","v":0},"일용소득 공제 적용"]
[null,"재산소득액",null,{"$f":"입력및결과!E34","v":0}]
[null,"기타소득액",null,{"$f":"입력및결과!E35","v":0}]
[null,"소계",null,{"$f":"D29+D30+D31","v":0}]
["가구원2","근로/사업소득","근로소득액",{"$f":"입력및결과!E36","v":0}]
[null,null,"일용소득액",{"$f":"입력및결과!E37","v":0}]
[null,null,"일용소득 공제액",{"$f":"ROUNDDOWN(D34*적용값!$F$8,)","v":0},"일용소득액의 50%"]
[null,null,"사업소득액",{"$f":"입력및결과!E38","v":0}]
[null,null,"적용 금액",{"$f":"D33+D34-D35+D36","v":0},"일용소득 공제 적용"]
[null,"재산소득액",null,{"$f":"입력및결과!E39","v":0}]
[null,"기타소득액",null,{"$f":"입력및결과!E40","v":0}]
[null,"소계",null,{"$f":"D37+D38+D39","v":0}]
["합계",null,null,{"$f":"D24+D32+D40","v":0}]
[]
["3. 재산의 소득환산액",null,null,null,"단위 : 원"]
["구분",null,null,"금액","비고"]
["일반재산\n소득환산액","일반재산액","주택, 건축물",{"$f":"입력및결과!C45","v":0}]
[null,null,"토지",{"$f":"입력및결과!C46","v":0}]
[null,null,"임차보증금(주거 목적)",{"$f":"입력및결과!C47*적용값!$F$12","v":0},"보정계수 0.95 적용"]
[null,null,"임차보증금(주거 목적 이외)",{"$f":"입력및결과!C48","v":0}]
[null,null,"기타 일반재산",{"$f":"입력및결과!C49","v":0}]
[null,null,"소계",{"$f":"SUM(D45:D49)","v":0}]
[null,"차감액","기본재산액(-)",{"$f":"적용값!$F$13","v":69000000}]
[null,null,"부채(-)",{"$f":"입력및결과!C51","v":0}]
[null,null,"소계",{"$f":"SUM(D51:D52)","v":69000000}]
[null,"일반재산액 - 차감액",null,{"$f":"D50-D53","v":-69000000}]
[null,"소득환산액","대상 금액",{"$f":"IF(D54>0,D54,0)","v":0}]
[null,null,"소득환산율",{"$f":"적용값!F9","v":1.3900000000000001E-2}]
[null,null,"소득환산액",{"$f":"ROUNDDOWN(D55*$D$56,)","v":0}]
["금융재산\n소득환산액","금융재산액","금융재산",{"$f":"입력및결과!C50","v":0}]
[null,"차감액","차감 잔액(-)",{"$f":"-IF(D54<0,D54,0)","v":69000000}]
[null,"금융재산액 - 차감액",null,{"$f":"D58-D59","v":-69000000}]
[null,"소득환산액","대상 금액",{"$f":"IF(D60>0,D60,0)","v":0}]
[null,null,"소득환산율",{"$f":"적용값!$F$10","v":2.0866666666666669E-2}]
[null,null,"소득환산액",{"$f":"ROUNDDOWN(D61*D62,)","v":0}]
["자동차\n소득환산액","소득환산액","차량가액",{"$f":"입력및결과!C52","v":0}]
[null,null,"소득환산율",{"$f":"적용값!F11","v":1.3900000000000001E-2}]
[null,null,"소득환산액",{"$f":"ROUNDDOWN(D64*D65,)","v":0}]
["합계",null,null,{"$f":"D57+D63+D66","v":0}]
[]
["4. 소득인정액(월)",null,null,null,"단위 : 원"]
["구분",null,null,"금액","비고"]
["소득평가액(월)",null,null,{"$f":"D41","v":0}]
["재산의 소득환산액(월)",null,null,{"$f":"D67","v":0}]
["형재,자매 수\n공제액","형재,자매 수 공제 대상 인원",null,{"$f":"IF(D7-2>0,D7-2,0)","v":0}]
[null,"형재,자매 수 1인당 공제액",null,{"$f":"ROUNDDOWN(D73*적용값!$F$14,)","v":0}]
["소득인정액(월)",null,null,{"$f":"D71+D72-D74","v":0}]

{"sheet":"적용값","index":2,"n_rows":21,"n_cols":8,"rows_kept":21,"cut":false,"hidden":false,"merged":[[9,6,9,7],[4,0,5,2],[6,1,6,2],[7,1,7,2],[8,1,8,2],[9,1,9,2],[6,0,7,0],[8,0,12,0],[4,3,4,5],[1,0,1,7],[4,6,5,7],[6,6,6,7],[7,6,7,7],[8,6,8,7],[16,1,16,7],[16,0,17,0],[10,6,10,7],[11,6,11,7],[12,6,12,7],[13,6,13,7],[10,1,10,2],[11,1,11,2],[12,1,12,2],[13,0,13,2]]}
[]
["계산 적용 값"]
[]
["1. 계산에 적용되는 값",{"$nulls":6},"단위 : 원"]
["항목",null,null,"값",null,null,"비고"]
[null,null,null,"환산율","배분","적용"]
["소득","학생의 근로/사업소득 공제액",null,null,null,1300000]
[null,"일용소득 공제율",null,null,null,0.5]
["재산","일반재산 환산율",null,4.1700000000000001E-2,3,{"$f":"D9/E9","v":1.3900000000000001E-2},"월 환산율"]
[null,"금융재산 환산율",null,6.2600000000000003E-2,3,{"$f":"D10/E10","v":2.0866666666666669E-2},"월 환산율"]
[null,"자동차 환산율",null,{"$f":"D9","v":4.1700000000000001E-2},3,1.3900000000000001E-2,"월 환산율"]
[null,"임차보증금 보정계수",null,null,null,0.95,"주거 목적의 주택"]
[null,"기본재산액",null,null,null,69000000]
["형제·자매 수 공제액",{"$nulls":4},400000,"2인 초과시 1인당 금액"]
[]
["2. 기준 중위소득(2026년)",{"$nulls":6},"단위 : 원"]
["구분","가구 수"]
[null,1,2,3,4,5,6,7]
["금액(원/월)",2564238,4199292,5359036,6494738,7556719,8555952,9515150]
["주1) 8인 이상 가구의 기준 중위소득 : 1인 증가시마다 959,198원씩 증가(8인가구 : 10,474,348원)"]
["주2) 기준 중위소득 최신 금액으로 변경하여 기입"]